5ttgen error: FSL FIRST has failed

I am having the 5ttgen error: FSL FIRST has failed.

5ttgen fsl T1_raw.mif 5tt_nocoreg.mif -premasked

5ttgen:
5ttgen: Note that this script makes use of commands / algorithms that have relevant articles for citation; INCLUDING FROM EXTERNAL SOFTWARE PACKAGES. Please consult the help page (-help option) for more information.
5ttgen:
5ttgen: Generated scratch directory: /home/nas/shahzad/ADF/ADNI/MRTrix_Preprocessing/13031/013_S_6970/DTI/5ttgen-tmp-MSOX8R/
Command: mrconvert /home/nas/shahzad/ADF/ADNI/MRTrix_Preprocessing/13031/013_S_6970/DTI/T1_raw.mif /home/nas/shahzad/ADF/ADNI/MRTrix_Preprocessing/13031/013_S_6970/DTI/5ttgen-tmp-MSOX8R/input.mif
5ttgen: Changing to scratch directory (/home/nas/shahzad/ADF/ADNI/MRTrix_Preprocessing/13031/013_S_6970/DTI/5ttgen-tmp-MSOX8R/)
Command: mrconvert input.mif T1.nii -strides -1,+2,+3
Command: fast T1.nii
Command: run_first_all -m none -s L_Accu,R_Accu,L_Caud,R_Caud,L_Pall,R_Pall,L_Puta,R_Puta,L_Thal,R_Thal -i T1.nii -o first -b

5ttgen: [ERROR] FSL FIRST has failed; only 6 of 10 structures were segmented successfully (check /home/nas/shahzad/ADF/ADNI/MRTrix_Preprocessing/13031/013_S_6970/DTI/5ttgen-tmp-MSOX8R/first.logs)
5ttgen: Scratch directory retained; location: /home/nas/shahzad/ADF/ADNI/MRTrix_Preprocessing/13031/013_S_6970/DTI/5ttgen-tmp-MSOX8R/

I am pasting here the contents of first.. files:

first.e*.*
/opt/fsl/bin/run_first: 1: bc: not found
/opt/fsl/bin/run_first: 1: bc: not found
/opt/fsl/bin/run_first: 1: bc: not found
/opt/fsl/bin/run_first: 1: bc: not found
/opt/fsl/bin/run_first: 1: bc: not found
/opt/fsl/bin/run_first: 141: [: -ne: unexpected operator
WARNING: NO INTERIOR VOXELS TO ESTIMATE MODE

first.e*.*
/opt/fsl/bin/run_first: 1: bc: not found
/opt/fsl/bin/run_first: 1: bc: not found
/opt/fsl/bin/run_first: 1: bc: not found
/opt/fsl/bin/run_first: 1: bc: not found
/opt/fsl/bin/run_first: 1: bc: not found
/opt/fsl/bin/run_first: 141: [: -ne: unexpected operator
WARNING: NO INTERIOR VOXELS TO ESTIMATE MODE

first.o*.*
create shapeModel
done creating shapeModel
0.114377 -0.0311928 -1.82781
1.53285 0.494281 0.114203
0.667625 -1.72792 -0.0184571
NEw done imodes transform
Error: cannot find image first-L_Accu_first

first.o*.*
create shapeModel
done creating shapeModel
0.114377 -0.0311928 -1.82781
1.53285 0.494281 0.114203
0.667625 -1.72792 -0.0184571
NEw done imodes transform
Error: cannot find image first-R_Accu_first

first.o*.*
create shapeModel
done creating shapeModel
create shapeModel
done creating shapeModel
0.114377 -0.0311928 -1.82781
1.53285 0.494281 0.114203
0.667625 -1.72792 -0.0184571
NEw done imodes transform
done registering model
mode 16.9676
0.114377 -0.0311928 -1.82781
1.53285 0.494281 0.114203
0.667625 -1.72792 -0.0184571
NEw done imodes transform
D
336 3204 3204 336
open file first-R_Caud_first.vtk to save.
succesfully opened file first-R_Caud_first.vtk to save.

first.o*.*
create shapeModel
done creating shapeModel
0.114377 -0.0311928 -1.82781
1.53285 0.494281 0.114203
0.667625 -1.72792 -0.0184571
NEw done imodes transform
Error: cannot find image first-L_Puta_first

first.o*.*
create shapeModel
done creating shapeModel
0.114377 -0.0311928 -1.82781
1.53285 0.494281 0.114203
0.667625 -1.72792 -0.0184571
NEw done imodes transform
Error: cannot find image first-R_Puta_first

first_post.e*.*
Image Exception : #63 :: No image files match: first-L_Accu_corr
terminate called after throwing an instance of ‘std::runtime_error’
what(): No image files match: first-L_Accu_corr
Aborted (core dumped)
Image Exception : #63 :: No image files match: first-L_Accu_first
terminate called after throwing an instance of ‘std::runtime_error’
what(): No image files match: first-L_Accu_first
Aborted (core dumped)
Image Exception : #63 :: No image files match: first_all_none_origsegs
Image Exception : #22 :: Failed to read volume first_all_none_origsegs
Error : No image files match: first_all_none_origsegs
Failed to read volume first_all_none_origsegs
Error : No image files match: first_all_none_origsegs

first_post.o*.*

i have tried to run run_first_all on T1.
but its not successful and the error seems to be same as in the log files of 5ttgen (which seems tobe error with T1 itself rather than 5ttgen):

run_first_all -i /home/nas/shahzad/ADF/ADNI/MRTrix_Preprocessing/13031/013_S_6970/T1/013_S_6970_001.nii.gz -o /home/nas/shahzad/ADF/ADNI/MRTrix_Preprocessing/13031/013_S_6970/T1/013_S_6970_FIRST
Error submitting job - Errors occured when running array task in shell plugin: Task 1 failed executing: /usr/local/fsl/bin/bash -c /usr/local/fsl/bin/run_first -i /home/nas/shahzad/ADF/ADNI/MRTrix_Preprocessing/13031/013_S_6970/T1/013_S_6970_001 -t /home/nas/shahzad/ADF/ADNI/MRTrix_Preprocessing/13031/013_S_6970/T1/013_S_6970_001_to_std_sub.mat -n 50 -o /home/nas/shahzad/ADF/ADNI/MRTrix_Preprocessing/13031/013_S_6970/T1/013_S_6970_FIRST-L_Accu_first -m /usr/local/fsl/data/first/models_336_bin/L_Accu_bin.bmv; /usr/local/fsl/bin/first_boundary_corr -s /home/nas/shahzad/ADF/ADNI/MRTrix_Preprocessing/13031/013_S_6970/T1/013_S_6970_FIRST-L_Accu_first -o /home/nas/shahzad/ADF/ADNI/MRTrix_Preprocessing/13031/013_S_6970/T1/013_S_6970_FIRST-L_Accu_corr -i /home/nas/shahzad/ADF/ADNI/MRTrix_Preprocessing/13031/013_S_6970/T1/013_S_6970_001 -b fast (WARNING: NO INTERIOR VOXELS TO ESTIMATE MODE
)
Task 2 failed executing: /usr/local/fsl/bin/bash -c /usr/local/fsl/bin/run_first -i /home/nas/shahzad/ADF/ADNI/MRTrix_Preprocessing/13031/013_S_6970/T1/013_S_6970_001 -t /home/nas/shahzad/ADF/ADNI/MRTrix_Preprocessing/13031/013_S_6970/T1/013_S_6970_001_to_std_sub.mat -n 50 -o /home/nas/shahzad/ADF/ADNI/MRTrix_Preprocessing/13031/013_S_6970/T1/013_S_6970_FIRST-L_Amyg_first -m /usr/local/fsl/data/first/models_336_bin/intref_thal/L_Amyg.bmv -intref /usr/local/fsl/data/first/models_336_bin/05mm/L_Thal_05mm.bmv; /usr/local/fsl/bin/first_boundary_corr -s /home/nas/shahzad/ADF/ADNI/MRTrix_Preprocessing/13031/013_S_6970/T1/013_S_6970_FIRST-L_Amyg_first -o /home/nas/shahzad/ADF/ADNI/MRTrix_Preprocessing/13031/013_S_6970/T1/013_S_6970_FIRST-L_Amyg_corr -i /home/nas/shahzad/ADF/ADNI/MRTrix_Preprocessing/13031/013_S_6970/T1/013_S_6970_001 -b fast (WARNING: NO INTERIOR VOXELS TO ESTIMATE MODE
)
Task 3 failed executing: /usr/local/fsl/bin/bash -c /usr/local/fsl/bin/run_first -i /home/nas/shahzad/ADF/ADNI/MRTrix_Preprocessing/13031/013_S_6970/T1/013_S_6970_001 -t /home/nas/shahzad/ADF/ADNI/MRTrix_Preprocessing/13031/013_S_6970/T1/013_S_6970_001_to_std_sub.mat -n 30 -o /home/nas/shahzad/ADF/ADNI/MRTrix_Preprocessing/13031/013_S_6970/T1/013_S_6970_FIRST-L_Caud_first -m /usr/local/fsl/data/first/models_336_bin/intref_thal/L_Caud.bmv -intref /usr/local/fsl/data/first/models_336_bin/05mm/L_Thal_05mm.bmv; /usr/local/fsl/bin/first_boundary_corr -s /home/nas/shahzad/ADF/ADNI/MRTrix_Preprocessing/13031/013_S_6970/T1/013_S_6970_FIRST-L_Caud_first -o /home/nas/shahzad/ADF/ADNI/MRTrix_Preprocessing/13031/013_S_6970/T1/013_S_6970_FIRST-L_Caud_corr -i /home/nas/shahzad/ADF/ADNI/MRTrix_Preprocessing/13031/013_S_6970/T1/013_S_6970_001 -b fast (WARNING: NO INTERIOR VOXELS TO ESTIMATE MODE
)
Task 4 failed executing: /usr/local/fsl/bin/bash -c /usr/local/fsl/bin/run_first -i /home/nas/shahzad/ADF/ADNI/MRTrix_Preprocessing/13031/013_S_6970/T1/013_S_6970_001 -t /home/nas/shahzad/ADF/ADNI/MRTrix_Preprocessing/13031/013_S_6970/T1/013_S_6970_001_to_std_sub.mat -n 30 -o /home/nas/shahzad/ADF/ADNI/MRTrix_Preprocessing/13031/013_S_6970/T1/013_S_6970_FIRST-L_Hipp_first -m /usr/local/fsl/data/first/models_336_bin/intref_thal/L_Hipp.bmv -intref /usr/local/fsl/data/first/models_336_bin/05mm/L_Thal_05mm.bmv; /usr/local/fsl/bin/first_boundary_corr -s /home/nas/shahzad/ADF/ADNI/MRTrix_Preprocessing/13031/013_S_6970/T1/013_S_6970_FIRST-L_Hipp_first -o /home/nas/shahzad/ADF/ADNI/MRTrix_Preprocessing/13031/013_S_6970/T1/013_S_6970_FIRST-L_Hipp_corr -i /home/nas/shahzad/ADF/ADNI/MRTrix_Preprocessing/13031/013_S_6970/T1/013_S_6970_001 -b fast (WARNING: NO INTERIOR VOXELS TO ESTIMATE MODE
)
Task 5 failed executing: /usr/local/fsl/bin/bash -c /usr/local/fsl/bin/run_first -i /home/nas/shahzad/ADF/ADNI/MRTrix_Preprocessing/13031/013_S_6970/T1/013_S_6970_001 -t /home/nas/shahzad/ADF/ADNI/MRTrix_Preprocessing/13031/013_S_6970/T1/013_S_6970_001_to_std_sub.mat -n 40 -o /home/nas/shahzad/ADF/ADNI/MRTrix_Preprocessing/13031/013_S_6970/T1/013_S_6970_FIRST-L_Pall_first -m /usr/local/fsl/data/first/models_336_bin/05mm/L_Pall_05mm.bmv; /usr/local/fsl/bin/first_boundary_corr -s /home/nas/shahzad/ADF/ADNI/MRTrix_Preprocessing/13031/013_S_6970/T1/013_S_6970_FIRST-L_Pall_first -o /home/nas/shahzad/ADF/ADNI/MRTrix_Preprocessing/13031/013_S_6970/T1/013_S_6970_FIRST-L_Pall_corr -i /home/nas/shahzad/ADF/ADNI/MRTrix_Preprocessing/13031/013_S_6970/T1/013_S_6970_001 -b none (WARNING: NO INTERIOR VOXELS TO ESTIMATE MODE
)
Task 6 failed executing: /usr/local/fsl/bin/bash -c /usr/local/fsl/bin/run_first -i /home/nas/shahzad/ADF/ADNI/MRTrix_Preprocessing/13031/013_S_6970/T1/013_S_6970_001 -t /home/nas/shahzad/ADF/ADNI/MRTrix_Preprocessing/13031/013_S_6970/T1/013_S_6970_001_to_std_sub.mat -n 40 -o /home/nas/shahzad/ADF/ADNI/MRTrix_Preprocessing/13031/013_S_6970/T1/013_S_6970_FIRST-L_Puta_first -m /usr/local/fsl/data/first/models_336_bin/05mm/L_Puta_05mm.bmv; /usr/local/fsl/bin/first_boundary_corr -s /home/nas/shahzad/ADF/ADNI/MRTrix_Preprocessing/13031/013_S_6970/T1/013_S_6970_FIRST-L_Puta_first -o /home/nas/shahzad/ADF/ADNI/MRTrix_Preprocessing/13031/013_S_6970/T1/013_S_6970_FIRST-L_Puta_corr -i /home/nas/shahzad/ADF/ADNI/MRTrix_Preprocessing/13031/013_S_6970/T1/013_S_6970_001 -b none (WARNING: NO INTERIOR VOXELS TO ESTIMATE MODE
)
Task 7 failed executing: /usr/local/fsl/bin/bash -c /usr/local/fsl/bin/run_first -i /home/nas/shahzad/ADF/ADNI/MRTrix_Preprocessing/13031/013_S_6970/T1/013_S_6970_001 -t /home/nas/shahzad/ADF/ADNI/MRTrix_Preprocessing/13031/013_S_6970/T1/013_S_6970_001_to_std_sub.mat -n 40 -o /home/nas/shahzad/ADF/ADNI/MRTrix_Preprocessing/13031/013_S_6970/T1/013_S_6970_FIRST-L_Thal_first -m /usr/local/fsl/data/first/models_336_bin/05mm/L_Thal_05mm.bmv; /usr/local/fsl/bin/first_boundary_corr -s /home/nas/shahzad/ADF/ADNI/MRTrix_Preprocessing/13031/013_S_6970/T1/013_S_6970_FIRST-L_Thal_first -o /home/nas/shahzad/ADF/ADNI/MRTrix_Preprocessing/13031/013_S_6970/T1/013_S_6970_FIRST-L_Thal_corr -i /home/nas/shahzad/ADF/ADNI/MRTrix_Preprocessing/13031/013_S_6970/T1/013_S_6970_001 -b none (WARNING: NO INTERIOR VOXELS TO ESTIMATE MODE
)
Task 8 failed executing: /usr/local/fsl/bin/bash -c /usr/local/fsl/bin/run_first -i /home/nas/shahzad/ADF/ADNI/MRTrix_Preprocessing/13031/013_S_6970/T1/013_S_6970_001 -t /home/nas/shahzad/ADF/ADNI/MRTrix_Preprocessing/13031/013_S_6970/T1/013_S_6970_001_to_std_sub.mat -n 50 -o /home/nas/shahzad/ADF/ADNI/MRTrix_Preprocessing/13031/013_S_6970/T1/013_S_6970_FIRST-R_Accu_first -m /usr/local/fsl/data/first/models_336_bin/R_Accu_bin.bmv; /usr/local/fsl/bin/first_boundary_corr -s /home/nas/shahzad/ADF/ADNI/MRTrix_Preprocessing/13031/013_S_6970/T1/013_S_6970_FIRST-R_Accu_first -o /home/nas/shahzad/ADF/ADNI/MRTrix_Preprocessing/13031/013_S_6970/T1/013_S_6970_FIRST-R_Accu_corr -i /home/nas/shahzad/ADF/ADNI/MRTrix_Preprocessing/13031/013_S_6970/T1/013_S_6970_001 -b fast (WARNING: NO INTERIOR VOXELS TO ESTIMATE MODE
)
Task 9 failed executing: /usr/local/fsl/bin/bash -c /usr/local/fsl/bin/run_first -i /home/nas/shahzad/ADF/ADNI/MRTrix_Preprocessing/13031/013_S_6970/T1/013_S_6970_001 -t /home/nas/shahzad/ADF/ADNI/MRTrix_Preprocessing/13031/013_S_6970/T1/013_S_6970_001_to_std_sub.mat -n 50 -o /home/nas/shahzad/ADF/ADNI/MRTrix_Preprocessing/13031/013_S_6970/T1/013_S_6970_FIRST-R_Amyg_first -m /usr/local/fsl/data/first/models_336_bin/intref_thal/R_Amyg.bmv -intref /usr/local/fsl/data/first/models_336_bin/05mm/R_Thal_05mm.bmv; /usr/local/fsl/bin/first_boundary_corr -s /home/nas/shahzad/ADF/ADNI/MRTrix_Preprocessing/13031/013_S_6970/T1/013_S_6970_FIRST-R_Amyg_first -o /home/nas/shahzad/ADF/ADNI/MRTrix_Preprocessing/13031/013_S_6970/T1/013_S_6970_FIRST-R_Amyg_corr -i /home/nas/shahzad/ADF/ADNI/MRTrix_Preprocessing/13031/013_S_6970/T1/013_S_6970_001 -b fast (WARNING: NO INTERIOR VOXELS TO ESTIMATE MODE
)
Task 10 failed executing: /usr/local/fsl/bin/bash -c /usr/local/fsl/bin/run_first -i /home/nas/shahzad/ADF/ADNI/MRTrix_Preprocessing/13031/013_S_6970/T1/013_S_6970_001 -t /home/nas/shahzad/ADF/ADNI/MRTrix_Preprocessing/13031/013_S_6970/T1/013_S_6970_001_to_std_sub.mat -n 30 -o /home/nas/shahzad/ADF/ADNI/MRTrix_Preprocessing/13031/013_S_6970/T1/013_S_6970_FIRST-R_Caud_first -m /usr/local/fsl/data/first/models_336_bin/intref_thal/R_Caud.bmv -intref /usr/local/fsl/data/first/models_336_bin/05mm/R_Thal_05mm.bmv; /usr/local/fsl/bin/first_boundary_corr -s /home/nas/shahzad/ADF/ADNI/MRTrix_Preprocessing/13031/013_S_6970/T1/013_S_6970_FIRST-R_Caud_first -o /home/nas/shahzad/ADF/ADNI/MRTrix_Preprocessing/13031/013_S_6970/T1/013_S_6970_FIRST-R_Caud_corr -i /home/nas/shahzad/ADF/ADNI/MRTrix_Preprocessing/13031/013_S_6970/T1/013_S_6970_001 -b fast (WARNING: NO INTERIOR VOXELS TO ESTIMATE MODE
)
Task 11 failed executing: /usr/local/fsl/bin/bash -c /usr/local/fsl/bin/run_first -i /home/nas/shahzad/ADF/ADNI/MRTrix_Preprocessing/13031/013_S_6970/T1/013_S_6970_001 -t /home/nas/shahzad/ADF/ADNI/MRTrix_Preprocessing/13031/013_S_6970/T1/013_S_6970_001_to_std_sub.mat -n 30 -o /home/nas/shahzad/ADF/ADNI/MRTrix_Preprocessing/13031/013_S_6970/T1/013_S_6970_FIRST-R_Hipp_first -m /usr/local/fsl/data/first/models_336_bin/intref_thal/R_Hipp.bmv -intref /usr/local/fsl/data/first/models_336_bin/05mm/R_Thal_05mm.bmv; /usr/local/fsl/bin/first_boundary_corr -s /home/nas/shahzad/ADF/ADNI/MRTrix_Preprocessing/13031/013_S_6970/T1/013_S_6970_FIRST-R_Hipp_first -o /home/nas/shahzad/ADF/ADNI/MRTrix_Preprocessing/13031/013_S_6970/T1/013_S_6970_FIRST-R_Hipp_corr -i /home/nas/shahzad/ADF/ADNI/MRTrix_Preprocessing/13031/013_S_6970/T1/013_S_6970_001 -b fast (WARNING: NO INTERIOR VOXELS TO ESTIMATE MODE
)
Task 12 failed executing: /usr/local/fsl/bin/bash -c /usr/local/fsl/bin/run_first -i /home/nas/shahzad/ADF/ADNI/MRTrix_Preprocessing/13031/013_S_6970/T1/013_S_6970_001 -t /home/nas/shahzad/ADF/ADNI/MRTrix_Preprocessing/13031/013_S_6970/T1/013_S_6970_001_to_std_sub.mat -n 40 -o /home/nas/shahzad/ADF/ADNI/MRTrix_Preprocessing/13031/013_S_6970/T1/013_S_6970_FIRST-R_Pall_first -m /usr/local/fsl/data/first/models_336_bin/05mm/R_Pall_05mm.bmv; /usr/local/fsl/bin/first_boundary_corr -s /home/nas/shahzad/ADF/ADNI/MRTrix_Preprocessing/13031/013_S_6970/T1/013_S_6970_FIRST-R_Pall_first -o /home/nas/shahzad/ADF/ADNI/MRTrix_Preprocessing/13031/013_S_6970/T1/013_S_6970_FIRST-R_Pall_corr -i /home/nas/shahzad/ADF/ADNI/MRTrix_Preprocessing/13031/013_S_6970/T1/013_S_6970_001 -b none (WARNING: NO INTERIOR VOXELS TO ESTIMATE MODE
)
Task 13 failed executing: /usr/local/fsl/bin/bash -c /usr/local/fsl/bin/run_first -i /home/nas/shahzad/ADF/ADNI/MRTrix_Preprocessing/13031/013_S_6970/T1/013_S_6970_001 -t /home/nas/shahzad/ADF/ADNI/MRTrix_Preprocessing/13031/013_S_6970/T1/013_S_6970_001_to_std_sub.mat -n 40 -o /home/nas/shahzad/ADF/ADNI/MRTrix_Preprocessing/13031/013_S_6970/T1/013_S_6970_FIRST-R_Puta_first -m /usr/local/fsl/data/first/models_336_bin/05mm/R_Puta_05mm.bmv; /usr/local/fsl/bin/first_boundary_corr -s /home/nas/shahzad/ADF/ADNI/MRTrix_Preprocessing/13031/013_S_6970/T1/013_S_6970_FIRST-R_Puta_first -o /home/nas/shahzad/ADF/ADNI/MRTrix_Preprocessing/13031/013_S_6970/T1/013_S_6970_FIRST-R_Puta_corr -i /home/nas/shahzad/ADF/ADNI/MRTrix_Preprocessing/13031/013_S_6970/T1/013_S_6970_001 -b none (WARNING: NO INTERIOR VOXELS TO ESTIMATE MODE
)
Task 14 failed executing: /usr/local/fsl/bin/bash -c /usr/local/fsl/bin/run_first -i /home/nas/shahzad/ADF/ADNI/MRTrix_Preprocessing/13031/013_S_6970/T1/013_S_6970_001 -t /home/nas/shahzad/ADF/ADNI/MRTrix_Preprocessing/13031/013_S_6970/T1/013_S_6970_001_to_std_sub.mat -n 40 -o /home/nas/shahzad/ADF/ADNI/MRTrix_Preprocessing/13031/013_S_6970/T1/013_S_6970_FIRST-R_Thal_first -m /usr/local/fsl/data/first/models_336_bin/05mm/R_Thal_05mm.bmv; /usr/local/fsl/bin/first_boundary_corr -s /home/nas/shahzad/ADF/ADNI/MRTrix_Preprocessing/13031/013_S_6970/T1/013_S_6970_FIRST-R_Thal_first -o /home/nas/shahzad/ADF/ADNI/MRTrix_Preprocessing/13031/013_S_6970/T1/013_S_6970_FIRST-R_Thal_corr -i /home/nas/shahzad/ADF/ADNI/MRTrix_Preprocessing/13031/013_S_6970/T1/013_S_6970_001 -b none (WARNING: NO INTERIOR VOXELS TO ESTIMATE MODE
)
Task 15 failed executing: /usr/local/fsl/bin/bash -c /usr/local/fsl/bin/run_first -i /home/nas/shahzad/ADF/ADNI/MRTrix_Preprocessing/13031/013_S_6970/T1/013_S_6970_001 -t /home/nas/shahzad/ADF/ADNI/MRTrix_Preprocessing/13031/013_S_6970/T1/013_S_6970_001_to_std_sub.mat -n 40 -o /home/nas/shahzad/ADF/ADNI/MRTrix_Preprocessing/13031/013_S_6970/T1/013_S_6970_FIRST-BrStem_first -m /usr/local/fsl/data/first/models_336_bin/BrStem_bin.bmv; /usr/local/fsl/bin/first_boundary_corr -s /home/nas/shahzad/ADF/ADNI/MRTrix_Preprocessing/13031/013_S_6970/T1/013_S_6970_FIRST-BrStem_first -o /home/nas/shahzad/ADF/ADNI/MRTrix_Preprocessing/13031/013_S_6970/T1/013_S_6970_FIRST-BrStem_corr -i /home/nas/shahzad/ADF/ADNI/MRTrix_Preprocessing/13031/013_S_6970/T1/013_S_6970_001 -b fast (WARNING: NO INTERIOR VOXELS TO ESTIMATE MODE
)
usage: fsl_sub [-h] [-a ARCH] [-c COPROCESSOR]
[–coprocessor_multi COPROCESSOR_MULTI]
[–coprocessor_class COPROCESSOR_CLASS]
[–coprocessor_class_strict]
[–coprocessor_toolkit COPROCESSOR_TOOLKIT] [-F] [-j JOBHOLD]
[–not_requeueable] [–array_hold ARRAY_HOLD] [-l LOGDIR]
[-m MAILOPTIONS] [-M MAILTO] [-n] [-N NAME] [-p PRIORITY]
[-q QUEUE] [-r RESOURCE] [–delete_job DELETE_JOB]
[–extra EXTRA] [-R GB] [-s PARALLELENV,THREADS]
[-t ARRAY_TASK] [–array_native ARRAY_NATIVE] [-x NUMBER]
[–keep_jobscript] [–has_coprocessor COPROCESSOR_NAME]
[–has_queues] [–project PROJECT] [-S] [-T MINUTES]
[–show_config] [-v] [-V] [-z file]

fsl_sub: error: argument -j/–jobhold: expected one argument
usage: fsl_sub [-h] [-a ARCH] [-c COPROCESSOR]
[–coprocessor_multi COPROCESSOR_MULTI]
[–coprocessor_class COPROCESSOR_CLASS]
[–coprocessor_class_strict]
[–coprocessor_toolkit COPROCESSOR_TOOLKIT] [-F] [-j JOBHOLD]
[–not_requeueable] [–array_hold ARRAY_HOLD] [-l LOGDIR]
[-m MAILOPTIONS] [-M MAILTO] [-n] [-N NAME] [-p PRIORITY]
[-q QUEUE] [-r RESOURCE] [–delete_job DELETE_JOB]
[–extra EXTRA] [-R GB] [-s PARALLELENV,THREADS]
[-t ARRAY_TASK] [–array_native ARRAY_NATIVE] [-x NUMBER]
[–keep_jobscript] [–has_coprocessor COPROCESSOR_NAME]
[–has_queues] [–project PROJECT] [-S] [-T MINUTES]
[–show_config] [-v] [-V] [-z file]

fsl_sub: error: argument -j/–jobhold: expected one argument